{"text_format":"3","workbook":"xlsx","n_sheets":6,"sheets":["Labor & Overhead Input","Estimation Input","Materials Catalog Input","Chart 1 Estimate","Chart 2 Materials","Chart 3 Overhead"],"not_rendered":{"charts":12,"defined_names":10},"unopened":[{"sheet":"Chart 1 Estimate","index":3,"reason":"not_a_worksheet"},{"sheet":"Chart 2 Materials","index":4,"reason":"not_a_worksheet"},{"sheet":"Chart 3 Overhead","index":5,"reason":"not_a_worksheet"}],"read":"whole","date_system":"1900"}

{"sheet":"Labor & Overhead Input","index":0,"n_rows":18,"n_cols":9,"rows_kept":18,"merged":[[4,9,4,10],[5,9,5,10],[6,9,6,10],[9,9,9,10],[10,9,10,10],[11,9,11,10],[12,9,12,10],[13,9,13,10],[16,9,16,10],[20,4,20,5]]}
[null,"Labor & Overhead",{"$nulls":6},"\"Do-It-Yourself\" Estimation Worksheet"]
[{"$nulls":8},"a free estimation template for MS Excel from Thomas Insulation Corporation"]
[null,"Insulator Labor (per Hour)"]
[null,"Base Labor Rate","Additional Benefits","Other Benefits","Corporate Tax","Insurance","Overhead","Total Labor Rate"]
[null,{"v":15,"d":"$15.00"},{"v":5,"d":"$5.00"},{"v":2,"d":"$2.00"},{"$f":"$B$5*B13","v":{"v":1.7999999999999998,"d":"$1.80"}},{"$f":"$B$5*C13","v":{"v":1.9500000000000002,"d":"$1.95"}},{"$f":"$B$5*I9","v":{"v":3.42,"d":"$3.42"}},{"$f":"SUM(B5:G5)","v":{"v":29.17,"d":"$29.17"}}]
[]
[null,"Overhead (per Month)"]
[null,"Annual Sales","Non Labor Expenses","Clerical Salaries","Officer Salaries","Corporate Tax","Insurance","Overhead","Overhead Percent"]
[null,{"v":500000,"d":"$500,000"},{"v":2000,"d":"$2,000"},{"v":1200,"d":"$1,200"},{"v":4800,"d":"$4,800"},{"$f":"SUM(D9:E9)*B13","v":{"v":720,"d":"$720"}},{"$f":"SUM(D9:E9)*C13","v":{"v":780,"d":"$780"}},{"$f":"SUM(C9:G9)","v":{"v":9500,"d":"$9,500"}},{"$f":"IF(AND(H9>0, B9>0),PRODUCT((H9*12)/B9),0)","v":{"v":0.228,"d":"22.80%"}}]
[]
[null,"Financial Rates"]
[null,"Corporate Tax Rate","Insurance Rate"]
[null,{"v":0.12,"d":"12.00%"},{"v":0.13,"d":"13.00%"}]
[]
[null,"Optimized for Screen Resolution 2560 x 1440"]
[null,"Free Estimation Template for Excel"]
[null,"Copyright 2000-2011 Thomas Insulation Corporation"]
[null,"All Rights Reserved"]

{"sheet":"Estimation Input","index":1,"n_rows":84,"n_cols":24,"rows_kept":84,"merged":[[57,1,57,3],[58,1,58,3],[59,1,59,3],[60,1,60,3],[61,1,61,3],[62,1,62,3],[63,1,63,3],[64,1,64,3],[65,1,65,3],[72,13,72,17],[73,1,73,3],[74,13,74,17],[76,13,76,17]]}
[null,"Estimate",{"$nulls":21},"\"Do-It-Yourself\" Estimation Worksheet"]
[{"$nulls":23},"a free estimation template for MS Excel from Thomas Insulation Corporation"]
[null,"Pipe Covering",{"$nulls":8},"Fitting Covers"]
[null,"ID","Qty","Unit Price","Product","Unit Subtotal","Unit Labor","Total Labor","Total Price",null,"ID","Qty","Unit Price","Product","Unit Subtotal","Unit Labor","Total Labor","Total Price"]
[null,100,50,{"$f":"IF(ISBLANK(B5),0,VLOOKUP(B5,'Materials Catalog Input'!$B$5:$I$904,4,FALSE))","v":{"v":1.284,"d":"$1.28"}},{"$f":"IF(ISBLANK(B5),0,VLOOKUP(B5,'Materials Catalog Input'!$B$5:$I$904,2,FALSE))","v":" 1/2 x 1/2"},{"$f":"C5*D5","v":{"v":64.2,"d":"$64.20"}},{"$f":"IF(ISBLANK(B5),0,VLOOKUP(B5,'Materials Catalog Input'!$B$5:$I$904,6,FALSE))","v":{"v":1.1668,"d":"$1.17"}},{"$f":"G5*C5","v":{"v":58.34,"d":"$58.34"}},{"$f":"SUM(F5,H5)","v":{"v":122.54,"d":"$122.54"}},null,600,35,{"$f":"IF(ISBLANK(K5),0,VLOOKUP(K5,'Materials Catalog Input'!$B$5:$I$904,4,FALSE))","v":{"v":0.6336,"d":"$0.63"}},{"$f":"IF(ISBLANK(K5),0,VLOOKUP(K5,'Materials Catalog Input'!$B$5:$I$904,2,FALSE))","v":"Nr 2 45s PVC  "},{"$f":"L5*M5","v":{"v":22.176000000000002,"d":"$22.18"}},{"$f":"IF(ISBLANK(K5),0,VLOOKUP(K5,'Materials Catalog Input'!$B$5:$I$904,6,FALSE))","v":{"v":3.64625,"d":"$3.65"}},{"$f":"P5*L5","v":{"v":127.61875,"d":"$127.62"}},{"$f":"SUM(O5,Q5)","v":{"v":149.79475000000002,"d":"$149.79"}}]
[null,101,22,{"$f":"IF(ISBLANK(B6),0,VLOOKUP(B6,'Materials Catalog Input'!$B$5:$I$904,4,FALSE))","v":{"v":1.3248,"d":"$1.32"}},{"$f":"IF(ISBLANK(B6),0,VLOOKUP(B6,'Materials Catalog Input'!$B$5:$I$904,2,FALSE))","v":" 1/2 x 1"},{"v":29.145599999999998,"d":"$29.15"},{"$f":"IF(ISBLANK(B6),0,VLOOKUP(B6,'Materials Catalog Input'!$B$5:$I$904,6,FALSE))","v":{"v":0.8334285714285715,"d":"$0.83"}},{"$f":"G6*C6","v":{"v":18.335428571428572,"d":"$18.34"}},{"$f":"SUM(F6,H6)","v":{"v":47.48102857142857,"d":"$47.48"}},{"$nulls":3},{"$f":"IF(ISBLANK(K6),0,VLOOKUP(K6,'Materials Catalog Input'!$B$5:$I$904,4,FALSE))","v":{"v":0,"d":"$0.00"}},{"$f":"IF(ISBLANK(K6),0,VLOOKUP(K6,'Materials Catalog Input'!$B$5:$I$904,2,FALSE))","v":0},{"v":0,"d":"$0.00"},{"$f":"IF(ISBLANK(K6),0,VLOOKUP(K6,'Materials Catalog Input'!$B$5:$I$904,6,FALSE))","v":{"v":0,"d":"$0.00"}},{"$f":"P6*L6","v":{"v":0,"d":"$0.00"}},{"$f":"SUM(O6,Q6)","v":{"v":0,"d":"$0.00"}}]
[{"$nulls":3},{"$f":"IF(ISBLANK(B7),0,VLOOKUP(B7,'Materials Catalog Input'!$B$5:$I$904,4,FALSE))","v":{"v":0,"d":"$0.00"}},{"$f":"IF(ISBLANK(B7),0,VLOOKUP(B7,'Materials Catalog Input'!$B$5:$I$904,2,FALSE))","v":0},{"v":0,"d":"$0.00"},{"$f":"IF(ISBLANK(B7),0,VLOOKUP(B7,'Materials Catalog Input'!$B$5:$I$904,6,FALSE))","v":{"v":0,"d":"$0.00"}},{"v":0,"d":"$0.00"},{"v":0,"d":"$0.00"},{"$nulls":3},{"$f":"IF(ISBLANK(K7),0,VLOOKUP(K7,'Materials Catalog Input'!$B$5:$I$904,4,FALSE))","v":{"v":0,"d":"$0.00"}},{"$f":"IF(ISBLANK(K7),0,VLOOKUP(K7,'Materials Catalog Input'!$B$5:$I$904,2,FALSE))","v":0},{"v":0,"d":"$0.00"},{"$f":"IF(ISBLANK(K7),0,VLOOKUP(K7,'Materials Catalog Input'!$B$5:$I$904,6,FALSE))","v":{"v":0,"d":"$0.00"}},{"v":0,"d":"$0.00"},{"v":0,"d":"$0.00"}]
[{"$nulls":3},{"$f":"IF(ISBLANK(B8),0,VLOOKUP(B8,'Materials Catalog Input'!$B$5:$I$904,4,FALSE))","v":{"v":0,"d":"$0.00"}},{"$f":"IF(ISBLANK(B8),0,VLOOKUP(B8,'Materials Catalog Input'!$B$5:$I$904,2,FALSE))","v":0},{"v":0,"d":"$0.00"},{"$f":"IF(ISBLANK(B8),0,VLOOKUP(B8,'Materials Catalog Input'!$B$5:$I$904,6,FALSE))","v":{"v":0,"d":"$0.00"}},{"v":0,"d":"$0.00"},{"v":0,"d":"$0.00"},{"$nulls":3},{"$f":"IF(ISBLANK(K8),0,VLOOKUP(K8,'Materials Catalog Input'!$B$5:$I$904,4,FALSE))","v":{"v":0,"d":"$0.00"}},{"$f":"IF(ISBLANK(K8),0,VLOOKUP(K8,'Materials Catalog Input'!$B$5:$I$904,2,FALSE))","v":0},{"v":0,"d":"$0.00"},{"$f":"IF(ISBLANK(K8),0,VLOOKUP(K8,'Materials Catalog Input'!$B$5:$I$904,6,FALSE))","v":{"v":0,"d":"$0.00"}},{"v":0,"d":"$0.00"},{"v":0,"d":"$0.00"}]
[{"$nulls":3},{"$f":"IF(ISBLANK(B9),0,VLOOKUP(B9,'Materials Catalog Input'!$B$5:$I$904,4,FALSE))","v":{"v":0,"d":"$0.00"}},{"$f":"IF(ISBLANK(B9),0,VLOOKUP(B9,'Materials Catalog Input'!$B$5:$I$904,2,FALSE))","v":0},{"v":0,"d":"$0.00"},{"$f":"IF(ISBLANK(B9),0,VLOOKUP(B9,'Materials Catalog Input'!$B$5:$I$904,6,FALSE))","v":{"v":0,"d":"$0.00"}},{"v":0,"d":"$0.00"},{"v":0,"d":"$0.00"},{"$nulls":3},{"$f":"IF(ISBLANK(K9),0,VLOOKUP(K9,'Materials Catalog Input'!$B$5:$I$904,4,FALSE))","v":{"v":0,"d":"$0.00"}},{"$f":"IF(ISBLANK(K9),0,VLOOKUP(K9,'Materials Catalog Input'!$B$5:$I$904,2,FALSE))","v":0},{"v":0,"d":"$0.00"},{"$f":"IF(ISBLANK(K9),0,VLOOKUP(K9,'Materials Catalog Input'!$B$5:$I$904,6,FALSE))","v":{"v":0,"d":"$0.00"}},{"v":0,"d":"$0.00"},{"v":0,"d":"$0.00"}]
[{"$nulls":3},{"$f":"IF(ISBLANK(B10),0,VLOOKUP(B10,'Materials Catalog Input'!$B$5:$I$904,4,FALSE))","v":{"v":0,"d":"$0.00"}},{"$f":"IF(ISBLANK(B10),0,VLOOKUP(B10,'Materials Catalog Input'!$B$5:$I$904,2,FALSE))","v":0},{"v":0,"d":"$0.00"},{"$f":"IF(ISBLANK(B10),0,VLOOKUP(B10,'Materials Catalog Input'!$B$5:$I$904,6,FALSE))","v":{"v":0,"d":"$0.00"}},{"v":0,"d":"$0.00"},{"v":0,"d":"$0.00"},{"$nulls":3},{"$f":"IF(ISBLANK(K10),0,VLOOKUP(K10,'Materials Catalog Input'!$B$5:$I$904,4,FALSE))","v":{"v":0,"d":"$0.00"}},{"$f":"IF(ISBLANK(K10),0,VLOOKUP(K10,'Materials Catalog Input'!$B$5:$I$904,2,FALSE))","v":0},{"v":0,"d":"$0.00"},{"$f":"IF(ISBLANK(K10),0,VLOOKUP(K10,'Materials Catalog Input'!$B$5:$I$904,6,FALSE))","v":{"v":0,"d":"$0.00"}},{"v":0,"d":"$0.00"},{"v":0,"d":"$0.00"}]
[{"$nulls":3},{"$f":"IF(ISBLANK(B11),0,VLOOKUP(B11,'Materials Catalog Input'!$B$5:$I$904,4,FALSE))","v":{"v":0,"d":"$0.00"}},{"$f":"IF(ISBLANK(B11),0,VLOOKUP(B11,'Materials Catalog Input'!$B$5:$I$904,2,FALSE))","v":0},{"v":0,"d":"$0.00"},{"$f":"IF(ISBLANK(B11),0,VLOOKUP(B11,'Materials Catalog Input'!$B$5:$I$904,6,FALSE))","v":{"v":0,"d":"$0.00"}},{"v":0,"d":"$0.00"},{"v":0,"d":"$0.00"},{"$nulls":3},{"$f":"IF(ISBLANK(K11),0,VLOOKUP(K11,'Materials Catalog Input'!$B$5:$I$904,4,FALSE))","v":{"v":0,"d":"$0.00"}},{"$f":"IF(ISBLANK(K11),0,VLOOKUP(K11,'Materials Catalog Input'!$B$5:$I$904,2,FALSE))","v":0},{"v":0,"d":"$0.00"},{"$f":"IF(ISBLANK(K11),0,VLOOKUP(K11,'Materials Catalog Input'!$B$5:$I$904,6,FALSE))","v":{"v":0,"d":"$0.00"}},{"v":0,"d":"$0.00"},{"v":0,"d":"$0.00"}]
[{"$nulls":3},{"$f":"IF(ISBLANK(B12),0,VLOOKUP(B12,'Materials Catalog Input'!$B$5:$I$904,4,FALSE))","v":{"v":0,"d":"$0.00"}},{"$f":"IF(ISBLANK(B12),0,VLOOKUP(B12,'Materials Catalog Input'!$B$5:$I$904,2,FALSE))","v":0},{"v":0,"d":"$0.00"},{"$f":"IF(ISBLANK(B12),0,VLOOKUP(B12,'Materials Catalog Input'!$B$5:$I$904,6,FALSE))","v":{"v":0,"d":"$0.00"}},{"v":0,"d":"$0.00"},{"v":0,"d":"$0.00"},{"$nulls":3},{"$f":"IF(ISBLANK(K12),0,VLOOKUP(K12,'Materials Catalog Input'!$B$5:$I$904,4,FALSE))","v":{"v":0,"d":"$0.00"}},{"$f":"IF(ISBLANK(K12),0,VLOOKUP(K12,'Materials Catalog Input'!$B$5:$I$904,2,FALSE))","v":0},{"v":0,"d":"$0.00"},{"$f":"IF(ISBLANK(K12),0,VLOOKUP(K12,'Materials Catalog Input'!$B$5:$I$904,6,FALSE))","v":{"v":0,"d":"$0.00"}},{"v":0,"d":"$0.00"},{"v":0,"d":"$0.00"}]
[{"$nulls":3},{"$f":"IF(ISBLANK(B13),0,VLOOKUP(B13,'Materials Catalog Input'!$B$5:$I$904,4,FALSE))","v":{"v":0,"d":"$0.00"}},{"$f":"IF(ISBLANK(B13),0,VLOOKUP(B13,'Materials Catalog Input'!$B$5:$I$904,2,FALSE))","v":0},{"$f":"C13*D13","v":{"v":0,"d":"$0.00"}},{"$f":"IF(ISBLANK(B13),0,VLOOKUP(B13,'Materials Catalog Input'!$B$5:$I$904,6,FALSE))","v":{"v":0,"d":"$0.00"}},{"$f":"G13*C13","v":{"v":0,"d":"$0.00"}},{"$f":"SUM(F13,H13)","v":{"v":0,"d":"$0.00"}},{"$nulls":3},{"$f":"IF(ISBLANK(K13),0,VLOOKUP(K13,'Materials Catalog Input'!$B$5:$I$904,4,FALSE))","v":{"v":0,"d":"$0.00"}},{"$f":"IF(ISBLANK(K13),0,VLOOKUP(K13,'Materials Catalog Input'!$B$5:$I$904,2,FALSE))","v":0},{"$f":"L13*M13","v":{"v":0,"d":"$0.00"}},{"$f":"IF(ISBLANK(K13),0,VLOOKUP(K13,'Materials Catalog Input'!$B$5:$I$904,6,FALSE))","v":{"v":0,"d":"$0.00"}},{"$f":"P13*L13","v":{"v":0,"d":"$0.00"}},{"$f":"SUM(O13,Q13)","v":{"v":0,"d":"$0.00"}}]
[{"$nulls":3},{"$f":"IF(ISBLANK(B14),0,VLOOKUP(B14,'Materials Catalog Input'!$B$5:$I$904,4,FALSE))","v":{"v":0,"d":"$0.00"}},{"$f":"IF(ISBLANK(B14),0,VLOOKUP(B14,'Materials Catalog Input'!$B$5:$I$904,2,FALSE))","v":0},{"v":0,"d":"$0.00"},{"$f":"IF(ISBLANK(B14),0,VLOOKUP(B14,'Materials Catalog Input'!$B$5:$I$904,6,FALSE))","v":{"v":0,"d":"$0.00"}},{"v":0,"d":"$0.00"},{"v":0,"d":"$0.00"},{"$nulls":3},{"$f":"IF(ISBLANK(K14),0,VLOOKUP(K14,'Materials Catalog Input'!$B$5:$I$904,4,FALSE))","v":{"v":0,"d":"$0.00"}},{"$f":"IF(ISBLANK(K14),0,VLOOKUP(K14,'Materials Catalog Input'!$B$5:$I$904,2,FALSE))","v":0},{"v":0,"d":"$0.00"},{"$f":"IF(ISBLANK(K14),0,VLOOKUP(K14,'Materials Catalog Input'!$B$5:$I$904,6,FALSE))","v":{"v":0,"d":"$0.00"}},{"v":0,"d":"$0.00"},{"v":0,"d":"$0.00"}]
[{"$nulls":3},{"$f":"IF(ISBLANK(B15),0,VLOOKUP(B15,'Materials Catalog Input'!$B$5:$I$904,4,FALSE))","v":{"v":0,"d":"$0.00"}},{"$f":"IF(ISBLANK(B15),0,VLOOKUP(B15,'Materials Catalog Input'!$B$5:$I$904,2,FALSE))","v":0},{"v":0,"d":"$0.00"},{"$f":"IF(ISBLANK(B15),0,VLOOKUP(B15,'Materials Catalog Input'!$B$5:$I$904,6,FALSE))","v":{"v":0,"d":"$0.00"}},{"v":0,"d":"$0.00"},{"v":0,"d":"$0.00"},{"$nulls":3},{"$f":"IF(ISBLANK(K15),0,VLOOKUP(K15,'Materials Catalog Input'!$B$5:$I$904,4,FALSE))","v":{"v":0,"d":"$0.00"}},{"$f":"IF(ISBLANK(K15),0,VLOOKUP(K15,'Materials Catalog Input'!$B$5:$I$904,2,FALSE))","v":0},{"v":0,"d":"$0.00"},{"$f":"IF(ISBLANK(K15),0,VLOOKUP(K15,'Materials Catalog Input'!$B$5:$I$904,6,FALSE))","v":{"v":0,"d":"$0.00"}},{"v":0,"d":"$0.00"},{"v":0,"d":"$0.00"}]
[{"$nulls":3},{"$f":"IF(ISBLANK(B16),0,VLOOKUP(B16,'Materials Catalog Input'!$B$5:$I$904,4,FALSE))","v":{"v":0,"d":"$0.00"}},{"$f":"IF(ISBLANK(B16),0,VLOOKUP(B16,'Materials Catalog Input'!$B$5:$I$904,2,FALSE))","v":0},{"v":0,"d":"$0.00"},{"$f":"IF(ISBLANK(B16),0,VLOOKUP(B16,'Materials Catalog Input'!$B$5:$I$904,6,FALSE))","v":{"v":0,"d":"$0.00"}},{"v":0,"d":"$0.00"},{"v":0,"d":"$0.00"},{"$nulls":3},{"$f":"IF(ISBLANK(K16),0,VLOOKUP(K16,'Materials Catalog Input'!$B$5:$I$904,4,FALSE))","v":{"v":0,"d":"$0.00"}},{"$f":"IF(ISBLANK(K16),0,VLOOKUP(K16,'Materials Catalog Input'!$B$5:$I$904,2,FALSE))","v":0},{"v":0,"d":"$0.00"},{"$f":"IF(ISBLANK(K16),0,VLOOKUP(K16,'Materials Catalog Input'!$B$5:$I$904,6,FALSE))","v":{"v":0,"d":"$0.00"}},{"v":0,"d":"$0.00"},{"v":0,"d":"$0.00"}]
[{"$nulls":3},{"$f":"IF(ISBLANK(B17),0,VLOOKUP(B17,'Materials Catalog Input'!$B$5:$I$904,4,FALSE))","v":{"v":0,"d":"$0.00"}},{"$f":"IF(ISBLANK(B17),0,VLOOKUP(B17,'Materials Catalog Input'!$B$5:$I$904,2,FALSE))","v":0},{"v":0,"d":"$0.00"},{"$f":"IF(ISBLANK(B17),0,VLOOKUP(B17,'Materials Catalog Input'!$B$5:$I$904,6,FALSE))","v":{"v":0,"d":"$0.00"}},{"v":0,"d":"$0.00"},{"v":0,"d":"$0.00"},{"$nulls":3},{"$f":"IF(ISBLANK(K17),0,VLOOKUP(K17,'Materials Catalog Input'!$B$5:$I$904,4,FALSE))","v":{"v":0,"d":"$0.00"}},{"$f":"IF(ISBLANK(K17),0,VLOOKUP(K17,'Materials Catalog Input'!$B$5:$I$904,2,FALSE))","v":0},{"v":0,"d":"$0.00"},{"$f":"IF(ISBLANK(K17),0,VLOOKUP(K17,'Materials Catalog Input'!$B$5:$I$904,6,FALSE))","v":{"v":0,"d":"$0.00"}},{"v":0,"d":"$0.00"},{"v":0,"d":"$0.00"}]
[{"$nulls":3},{"$f":"IF(ISBLANK(B18),0,VLOOKUP(B18,'Materials Catalog Input'!$B$5:$I$904,4,FALSE))","v":{"v":0,"d":"$0.00"}},{"$f":"IF(ISBLANK(B18),0,VLOOKUP(B18,'Materials Catalog Input'!$B$5:$I$904,2,FALSE))","v":0},{"v":0,"d":"$0.00"},{"$f":"IF(ISBLANK(B18),0,VLOOKUP(B18,'Materials Catalog Input'!$B$5:$I$904,6,FALSE))","v":{"v":0,"d":"$0.00"}},{"v":0,"d":"$0.00"},{"v":0,"d":"$0.00"},{"$nulls":3},{"$f":"IF(ISBLANK(K18),0,VLOOKUP(K18,'Materials Catalog Input'!$B$5:$I$904,4,FALSE))","v":{"v":0,"d":"$0.00"}},{"$f":"IF(ISBLANK(K18),0,VLOOKUP(K18,'Materials Catalog Input'!$B$5:$I$904,2,FALSE))","v":0},{"v":0,"d":"$0.00"},{"$f":"IF(ISBLANK(K18),0,VLOOKUP(K18,'Materials Catalog Input'!$B$5:$I$904,6,FALSE))","v":{"v":0,"d":"$0.00"}},{"v":0,"d":"$0.00"},{"v":0,"d":"$0.00"}]
[{"$nulls":3},{"$f":"IF(ISBLANK(B19),0,VLOOKUP(B19,'Materials Catalog Input'!$B$5:$I$904,4,FALSE))","v":{"v":0,"d":"$0.00"}},{"$f":"IF(ISBLANK(B19),0,VLOOKUP(B19,'Materials Catalog Input'!$B$5:$I$904,2,FALSE))","v":0},{"v":0,"d":"$0.00"},{"$f":"IF(ISBLANK(B19),0,VLOOKUP(B19,'Materials Catalog Input'!$B$5:$I$904,6,FALSE))","v":{"v":0,"d":"$0.00"}},{"v":0,"d":"$0.00"},{"v":0,"d":"$0.00"},{"$nulls":3},{"$f":"IF(ISBLANK(K19),0,VLOOKUP(K19,'Materials Catalog Input'!$B$5:$I$904,4,FALSE))","v":{"v":0,"d":"$0.00"}},{"$f":"IF(ISBLANK(K19),0,VLOOKUP(K19,'Materials Catalog Input'!$B$5:$I$904,2,FALSE))","v":0},{"v":0,"d":"$0.00"},{"$f":"IF(ISBLANK(K19),0,VLOOKUP(K19,'Materials Catalog Input'!$B$5:$I$904,6,FALSE))","v":{"v":0,"d":"$0.00"}},{"v":0,"d":"$0.00"},{"v":0,"d":"$0.00"}]
[{"$nulls":3},{"$f":"IF(ISBLANK(B20),0,VLOOKUP(B20,'Materials Catalog Input'!$B$5:$I$904,4,FALSE))","v":{"v":0,"d":"$0.00"}},{"$f":"IF(ISBLANK(B20),0,VLOOKUP(B20,'Materials Catalog Input'!$B$5:$I$904,2,FALSE))","v":0},{"v":0,"d":"$0.00"},{"$f":"IF(ISBLANK(B20),0,VLOOKUP(B20,'Materials Catalog Input'!$B$5:$I$904,6,FALSE))","v":{"v":0,"d":"$0.00"}},{"v":0,"d":"$0.00"},{"v":0,"d":"$0.00"},{"$nulls":3},{"$f":"IF(ISBLANK(K20),0,VLOOKUP(K20,'Materials Catalog Input'!$B$5:$I$904,4,FALSE))","v":{"v":0,"d":"$0.00"}},{"$f":"IF(ISBLANK(K20),0,VLOOKUP(K20,'Materials Catalog Input'!$B$5:$I$904,2,FALSE))","v":0},{"v":0,"d":"$0.00"},{"$f":"IF(ISBLANK(K20),0,VLOOKUP(K20,'Materials Catalog Input'!$B$5:$I$904,6,FALSE))","v":{"v":0,"d":"$0.00"}},{"v":0,"d":"$0.00"},{"v":0,"d":"$0.00"}]
{"$rows_left_out":65}
{"sheet":"Materials Catalog Input","index":2,"n_rows":904,"n_cols":24,"rows_kept":904}
[null,"Materials Catalog",{"$nulls":6},"\"Do-It-Yourself\" Estimation Worksheet"]
[{"$nulls":8},"a free estimation template for MS Excel from Thomas Insulation Corporation"]
[{"$nulls":7},"Price Markup Rate:",{"v":0.2,"d":"20%"}]
[null,"Product ID","Product Name","My Cost","Price Markup","Material Factor","Labor Factor","Description","Category"]
[null,100," 1/2 x 1/2",{"v":1.07,"d":"$1.07"},{"$f":"D5*(1+$I$3)","v":{"v":1.284,"d":"$1.28"}},{"v":25,"d":"25.0"},{"$f":"IF(F5>0,PRODUCT('Labor & Overhead Input'!$H$5/'Materials Catalog Input'!F5),\"0\")","v":{"v":1.1668,"d":"$1.17"}},"Knauf","Fiberglass"]
[null,101," 1/2 x 1",{"v":1.104,"d":"$1.10"},{"v":1.3248,"d":"$1.32"},{"v":35,"d":"35.0"},{"$f":"IF(F6>0,PRODUCT('Labor & Overhead Input'!$H$5/'Materials Catalog Input'!F6),\"0\")","v":{"v":0.8334285714285715,"d":"$0.83"}},"Knauf","Fiberglass"]
[null,102," 1/2 x 1-1/2",{"v":2.256,"d":"$2.26"},{"v":2.7072,"d":"$2.71"},{"v":35,"d":"35.0"},{"$f":"IF(F7>0,PRODUCT('Labor & Overhead Input'!$H$5/'Materials Catalog Input'!F7),\"0\")","v":{"v":0.8334285714285715,"d":"$0.83"}},"Knauf","Fiberglass"]
[null,103," 1/2 x 2",{"v":3.528,"d":"$3.53"},{"v":4.2336,"d":"$4.23"},{"v":35,"d":"35.0"},{"$f":"IF(F8>0,PRODUCT('Labor & Overhead Input'!$H$5/'Materials Catalog Input'!F8),\"0\")","v":{"v":0.8334285714285715,"d":"$0.83"}},"Knauf","Fiberglass"]
[null,104," 3/4 x 1/2",{"v":1.236,"d":"$1.24"},{"v":1.4831999999999999,"d":"$1.48"},{"v":35,"d":"35.0"},{"$f":"IF(F9>0,PRODUCT('Labor & Overhead Input'!$H$5/'Materials Catalog Input'!F9),\"0\")","v":{"v":0.8334285714285715,"d":"$0.83"}},"Knauf","Fiberglass"]
[null,105," 3/4 x 1",{"v":1.272,"d":"$1.27"},{"v":1.5264,"d":"$1.53"},{"v":35,"d":"35.0"},{"$f":"IF(F10>0,PRODUCT('Labor & Overhead Input'!$H$5/'Materials Catalog Input'!F10),\"0\")","v":{"v":0.8334285714285715,"d":"$0.83"}},"Knauf","Fiberglass"]
[null,106," 3/4 x 1-1/2",{"v":2.364,"d":"$2.36"},{"v":2.8367999999999998,"d":"$2.84"},{"v":35,"d":"35.0"},{"$f":"IF(F11>0,PRODUCT('Labor & Overhead Input'!$H$5/'Materials Catalog Input'!F11),\"0\")","v":{"v":0.8334285714285715,"d":"$0.83"}},"Knauf","Fiberglass"]
[null,107," 3/4 x 2",{"v":3.66,"d":"$3.66"},{"v":4.392,"d":"$4.39"},{"v":35,"d":"35.0"},{"$f":"IF(F12>0,PRODUCT('Labor & Overhead Input'!$H$5/'Materials Catalog Input'!F12),\"0\")","v":{"v":0.8334285714285715,"d":"$0.83"}},"Knauf","Fiberglass"]
[null,108," 1 x 1/2",{"v":1.248,"d":"$1.25"},{"v":1.4976,"d":"$1.50"},{"v":35,"d":"35.0"},{"$f":"IF(F13>0,PRODUCT('Labor & Overhead Input'!$H$5/'Materials Catalog Input'!F13),\"0\")","v":{"v":0.8334285714285715,"d":"$0.83"}},"Knauf","Fiberglass"]
[null,109," 1 x 1",{"v":1.284,"d":"$1.28"},{"v":1.5408,"d":"$1.54"},{"v":35,"d":"35.0"},{"$f":"IF(F14>0,PRODUCT('Labor & Overhead Input'!$H$5/'Materials Catalog Input'!F14),\"0\")","v":{"v":0.8334285714285715,"d":"$0.83"}},"Knauf","Fiberglass"]
[null,110," 1 x 1-1/2",{"v":2.472,"d":"$2.47"},{"v":2.9663999999999997,"d":"$2.97"},{"v":35,"d":"35.0"},{"$f":"IF(F15>0,PRODUCT('Labor & Overhead Input'!$H$5/'Materials Catalog Input'!F15),\"0\")","v":{"v":0.8334285714285715,"d":"$0.83"}},"Knauf","Fiberglass"]
[null,111," 1 x 2",{"v":3.9,"d":"$3.90"},{"v":4.68,"d":"$4.68"},{"v":35,"d":"35.0"},{"$f":"IF(F16>0,PRODUCT('Labor & Overhead Input'!$H$5/'Materials Catalog Input'!F16),\"0\")","v":{"v":0.8334285714285715,"d":"$0.83"}},"Knauf","Fiberglass"]
[null,112," 1 x 2-1/2",{"v":4.776,"d":"$4.78"},{"v":5.731199999999999,"d":"$5.73"},{"v":35,"d":"35.0"},{"$f":"IF(F17>0,PRODUCT('Labor & Overhead Input'!$H$5/'Materials Catalog Input'!F17),\"0\")","v":{"v":0.8334285714285715,"d":"$0.83"}},"Knauf","Fiberglass"]
[null,113," 1 x 3",{"v":6.348,"d":"$6.35"},{"v":7.6175999999999995,"d":"$7.62"},{"v":35,"d":"35.0"},{"$f":"IF(F18>0,PRODUCT('Labor & Overhead Input'!$H$5/'Materials Catalog Input'!F18),\"0\")","v":{"v":0.8334285714285715,"d":"$0.83"}},"Knauf","Fiberglass"]
[null,114," 1 x 3-1/2",{"v":8.088,"d":"$8.09"},{"v":9.705599999999999,"d":"$9.71"},{"v":35,"d":"35.0"},{"$f":"IF(F19>0,PRODUCT('Labor & Overhead Input'!$H$5/'Materials Catalog Input'!F19),\"0\")","v":{"v":0.8334285714285715,"d":"$0.83"}},"Knauf","Fiberglass"]
[null,115," 1 x 4",{"v":11.027999999999999,"d":"$11.03"},{"v":13.233599999999997,"d":"$13.23"},{"v":35,"d":"35.0"},{"$f":"IF(F20>0,PRODUCT('Labor & Overhead Input'!$H$5/'Materials Catalog Input'!F20),\"0\")","v":{"v":0.8334285714285715,"d":"$0.83"}},"Knauf","Fiberglass"]
{"$rows_left_out":884}